Reaction Details
Target5-hydroxytryptamine receptor 1A/1B/1D/2C
LigandBDBM50130290
Substrate/Competitorn/a
Ki 1204.81±n/a nM
CommentsPDSP_1247
Citation Richelson, E Neuroleptic binding to human brain receptors: relation to clinical effects. Ann N Y Acad Sci537:435-42 (1988) 
 
5-hydroxytryptamine receptor 1A/1B/1D/2C
Name:5-hydroxytryptamine receptor 1A/1B/1D/2C
Synonyms:5-HT1
Type:n/a
Mol. Mass.:n/a
Description:TL
Components:This complex has 0 components.
Component 1
Name:5-hydroxytryptamine receptor 1A
Type:n/a
Mol. Mass.:46122.49
Organism:Homo sapiens (Human)
Description:n/a
Residue:422
Component 2
Name:5-hydroxytryptamine receptor 1B
Synonyms:5-HT-1B 5-HT1B 5HT1B_HUMAN HTR1DB Serotonin (5-HT) receptor Serotonin Receptor 1B
Type:G Protein-Coupled Receptor (GPCR)
Mol. Mass.:43579.17
Organism:Homo sapiens (Human)
Description:Receptor binding assays were performed using human clone stably expressed in CHO cells
Residue:390
Component 3
Name:5-hydroxytryptamine receptor 2C
Synonyms:5-HT-1C 5-HT1C 5-HT2C-INI 5-HTR2C 5-hydroxytryptamine receptor 2C (5-HT-2C) 5HT-1C HTR1C Serotonin (5-HT3) receptor Serotonin Receptor 2C
Type:G Protein-Coupled Receptor (GPCR)
Mol. Mass.:51836.79
Organism:Homo sapiens (Human)
Description:P28335
Residue:458
Component 4
Name:5-hydroxytryptamine receptor 1D
Synonyms:5-HT-1D 5-HT1D 5HT1D_HUMAN HTR1DA Serotonin (5-HT) receptor | Serotonin Receptor 1D
Type:G Protein-Coupled Receptor (GPCR)
Mol. Mass.:41920.63
Organism:Homo sapiens (Human)
Description:Receptor binding assays were performed using human clone stably expressed in CHO cells.
Residue:377
BDBM50130290
NameBDBM50130290
Synonyms:3-Ethyl-2-methyl-5-morpholin-4-ylmethyl-1,5,6,7-tetrahydro-indol-4-one CHEMBL460 Moban
TypeSmall organic molecule
Emp. Form.C16H24N2O2
Mol. Mass.276.374
SMILESCCc1c(C)[nH]c2CCC(CN3CCOCC3)C(=O)c12