Reaction Details
TargetMuscarinic acetylcholine receptor M2
LigandBDBM78434
Substrate/Competitorn/a
Ki 555.55±n/a nM
CommentsPDSP_1531
Citation Richelson, E Neuroleptic binding to human brain receptors: relation to clinical effects. Ann N Y Acad Sci537:435-42 (1988) 
 
Muscarinic acetylcholine receptor M2
Name:Muscarinic acetylcholine receptor M2
Type:GPCR
Mol. Mass.:51730.61
Organism:Homo sapiens (Human)
Description:P08172
Residue:466
BDBM78434
NameBDBM78434
Synonyms:2-chloranyl-10-[3-(4-methylpiperazin-1-yl)propyl]phenothiazine;ethane-1,2-disulfonic acid 2-chloro-10-[3-(4-methylpiperazin-1-yl)propyl]phenothiazine;ethane-1,2-disulfonic acid Compazine MLS001148133 SMR000653454 | cid_91499
TypeSmall organic molecule
Emp. Form.C20H24ClN3S
Mol. Mass.373.943
SMILESCN1CCN(CCCN2c3ccccc3Sc3ccc(Cl)cc23)CC1