Reaction Details
TargetSodium-dependent serotonin transporter
LigandBDBM50028091
Substrate/Competitorn/a
Ki 3.08±n/a nM
CommentsPDSP_844
Citation Shank, RPVaught, JLPelley, KASetler, PEMcComsey, DFMaryanoff, BE McN-5652: a highly potent inhibitor of serotonin uptake. J Pharmacol Exp Ther247:1032-8 (1988) Sodium-dependent serotonin transporter
Name:Sodium-dependent serotonin transporter
Type:Multi-pass membrane protein
Mol. Mass.:70168.43
Organism:Rattus norvegicus (rat)
Description:P31652
Residue:630
BDBM50028091
NameBDBM50028091
Synonyms:(1E)-5-methoxy-1-[4-(trifluoromethyl)phenyl]pentan-1-one O-(2-aminoethyl)oxime FLUVOXAMINE
TypeSmall organic molecule
Emp. Form.C15H21F3N2O2
Mol. Mass.318.3346
SMILESCOCCCC\C(=N/OCCN)c1ccc(cc1)C(F)(F)F