Reaction Details
TargetSodium-dependent serotonin transporter
LigandBDBM81991
Substrate/Competitorn/a
Ki 0.4±n/a nM
CommentsPDSP_3138
Citation Shank, RPVaught, JLPelley, KASetler, PEMcComsey, DFMaryanoff, BE McN-5652: a highly potent inhibitor of serotonin uptake. J Pharmacol Exp Ther247:1032-8 (1988) Sodium-dependent serotonin transporter
Name:Sodium-dependent serotonin transporter
Type:Multi-pass membrane protein
Mol. Mass.:70168.43
Organism:Rattus norvegicus (rat)
Description:P31652
Residue:630
BDBM81991
NameBDBM81991
Synonyms:McN-5652-X-68
Typen/a
Emp. Form.C19H21NS
Mol. Mass.295.442
SMILESCSc1ccc(cc1)[C@H]1CN2CCC[C@H]2c2ccccc12