Reaction Details
TargetThromboxane A2 receptor
LigandBDBM81999
Substrate/Competitorn/a
Ki 31.8±n/a nM
CommentsPDSP_1746
Citation Hedberg, AHall, SEOgletree, MLHarris, DNLiu, EC Characterization of [5,6-3H]SQ 29,548 as a high affinity radioligand, binding to thromboxane A2/prostaglandin H2-receptors in human platelets. J Pharmacol Exp Ther245:786-92 (1988) Thromboxane A2 receptor
Name:Thromboxane A2 receptor
Type:Enyzme
Mol. Mass.:37445.28
Organism:Homo sapiens (Human)
Description:P21731
Residue:343
BDBM81999
NameBDBM81999
Synonyms:CAS_3036123 SQ 28668
TypeSmall organic molecule
Emp. Form.C24H32O4
Mol. Mass.384.5085
SMILESCC(C(O)C=CC1C2CCC(O2)C1CC=CCCCC(O)=O)c1ccccc1