Reaction Details
TargetThromboxane A2 receptor
LigandBDBM50008781
Substrate/Competitorn/a
Ki 7.34±n/a nM
CommentsPDSP_1747
Citation Hedberg, AHall, SEOgletree, MLHarris, DNLiu, EC Characterization of [5,6-3H]SQ 29,548 as a high affinity radioligand, binding to thromboxane A2/prostaglandin H2-receptors in human platelets. J Pharmacol Exp Ther245:786-92 (1988) Thromboxane A2 receptor
Name:Thromboxane A2 receptor
Type:Enyzme
Mol. Mass.:37445.28
Organism:Homo sapiens (Human)
Description:P21731
Residue:343
BDBM50008781
NameBDBM50008781
Synonyms:7-(3-(2-ethyl-N-phenylhydrazinecarboxamide)-7-oxa-bicyclo[2.2.1]hept-2-yl)-hept-5-enoic acid SQ 29548 | SQ-29548
TypeSmall organic molecule
Emp. Form.C21H29N3O4
Mol. Mass.387.4727
SMILESOC(=O)CCC\C=C/C[C@H]1[C@@H]2CCC(O2)[C@H]1CNNC(=O)Nc1ccccc1