Reaction Details
TargetThromboxane A2 receptor
LigandBDBM81998
Substrate/Competitorn/a
Ki 49.6±n/a nM
CommentsPDSP_1748
Citation Hedberg, AHall, SEOgletree, MLHarris, DNLiu, EC Characterization of [5,6-3H]SQ 29,548 as a high affinity radioligand, binding to thromboxane A2/prostaglandin H2-receptors in human platelets. J Pharmacol Exp Ther245:786-92 (1988) Thromboxane A2 receptor
Name:Thromboxane A2 receptor
Type:Enyzme
Mol. Mass.:37445.28
Organism:Homo sapiens (Human)
Description:P21731
Residue:343
BDBM81998
NameBDBM81998
Synonyms:CAS_119571 SQ 30741
TypeSmall organic molecule
Emp. Form.C23H38N2O5
Mol. Mass.422.5582
SMILESCCCCCCC(=O)NCC(=O)NCC1C2CCC(O2)C1CC=CCCCC(O)=O