Reaction Details
TargetThromboxane A2 receptor
LigandBDBM81997
Substrate/Competitorn/a
Ki 7.1±n/a nM
CommentsPDSP_1933
Citation Hedberg, AHall, SEOgletree, MLHarris, DNLiu, EC Characterization of [5,6-3H]SQ 29,548 as a high affinity radioligand, binding to thromboxane A2/prostaglandin H2-receptors in human platelets. J Pharmacol Exp Ther245:786-92 (1988) Thromboxane A2 receptor
Name:Thromboxane A2 receptor
Type:Enyzme
Mol. Mass.:37445.28
Organism:Homo sapiens (Human)
Description:P21731
Residue:343
BDBM81997
NameBDBM81997
Synonyms:CAS_114865 U44069
TypeSmall organic molecule
Emp. Form.C21H34O4
Mol. Mass.350.4923
SMILESCCCCCC(O)C=CC1C2COC(C2)C1CC=CCCCC(O)=O