Reaction Details
TargetAdenosine receptor A2a
LigandBDBM82012
Substrate/Competitorn/a
Ki>10000±n/a nM
CommentsPDSP_2817
Citation Schwabe, UUkena, DLohse, MJ Xanthine derivatives as antagonists at A1 and A2 adenosine receptors. Naunyn Schmiedebergs Arch Pharmacol330:212-21 (1985) 
 
Adenosine receptor A2a
Name:Adenosine receptor A2a
Type:G Protein-Coupled Receptor (GPCR)
Mol. Mass.:44716.46
Organism:Homo sapiens (Human)
Description:P29274
Residue:412
BDBM82012
NameBDBM82012
Synonyms:8-(4-Hydroxy-phenyl)-1,3-dimethyl-3,7-dihydro-purine-2,6-dione CHEMBL27047
Typen/a
Emp. Form.C13H12N4O3
Mol. Mass.272.2594
SMILESCn1c2nc([nH]c2c(=O)n(C)c1=O)-c1ccc(O)cc1