Reaction Details
TargetAdenosine receptor A2a
LigandBDBM15336
Substrate/Competitorn/a
Ki>10000±n/a nM
CommentsPDSP_2710
Citation Schwabe, UUkena, DLohse, MJ Xanthine derivatives as antagonists at A1 and A2 adenosine receptors. Naunyn Schmiedebergs Arch Pharmacol330:212-21 (1985) 
 
Adenosine receptor A2a
Name:Adenosine receptor A2a
Type:G Protein-Coupled Receptor (GPCR)
Mol. Mass.:44716.46
Organism:Homo sapiens (Human)
Description:P29274
Residue:412
BDBM15336
NameBDBM15336
Synonyms:1-methyl-3-(2-methylpropyl)-2,3,6,7-tetrahydro-1H-purine-2,6-dione 3-Isobutyl-1-methylxanthine IBMX | isobutylmethylxanthine
TypeSmall organic molecule
Emp. Form.C10H14N4O2
Mol. Mass.222.2438
SMILESCC(C)Cn1c2nc[nH]c2c(=O)n(C)c1=O