Reaction Details
TargetAdenosine receptor A2a
LigandBDBM50028190
Substrate/Competitorn/a
Ki>10000±n/a nM
CommentsPDSP_2808
Citation Schwabe, UUkena, DLohse, MJ Xanthine derivatives as antagonists at A1 and A2 adenosine receptors. Naunyn Schmiedebergs Arch Pharmacol330:212-21 (1985) 
 
Adenosine receptor A2a
Name:Adenosine receptor A2a
Type:G Protein-Coupled Receptor (GPCR)
Mol. Mass.:44716.46
Organism:Homo sapiens (Human)
Description:P29274
Residue:412
BDBM50028190
NameBDBM50028190
Synonyms:7-(2-Hydroxy-propyl)-1,3-dimethyl-3,7-dihydro-purine-2,6-dione CHEMBL37390 Proxyphylline
TypeSmall organic molecule
Emp. Form.C10H14N4O3
Mol. Mass.238.2432
SMILESCC(O)Cn1cnc2n(C)c(=O)n(C)c(=O)c12