Reaction Details
TargetAdenosine receptor A1
LigandBDBM82045
Substrate/Competitorn/a
Ki 92.8±n/a nM
CommentsPDSP_2525
Citation Bruns, RFLu, GHPugsley, TA Characterization of the A2 adenosine receptor labeled by [3H]NECA in rat striatal membranes. Mol Pharmacol29:331-46 (1986) Adenosine receptor A1
Name:Adenosine receptor A1
Type:Protein
Mol. Mass.:36704.13
Organism:Rattus norvegicus (rat)
Description:n/a
Residue:326
BDBM82045
NameBDBM82045
Synonyms:5'-Deoxy-5'-iodoado
Typen/a
Emp. Form.C10H12IN5O3
Mol. Mass.377.1385
SMILESNc1ncnc2n(cnc12)[C@@H]1O[C@H](CI)[C@@H](O)[C@H]1O