Reaction Details
TargetAdenosine receptor A1
LigandBDBM82047
Substrate/Competitorn/a
Ki 72.4±n/a nM
CommentsPDSP_2500
Citation Bruns, RFLu, GHPugsley, TA Characterization of the A2 adenosine receptor labeled by [3H]NECA in rat striatal membranes. Mol Pharmacol29:331-46 (1986) Adenosine receptor A1
Name:Adenosine receptor A1
Type:Protein
Mol. Mass.:36704.13
Organism:Rattus norvegicus (rat)
Description:n/a
Residue:326
BDBM82047
NameBDBM82047
Synonyms:8-(3-Furyl)theophylline
Typen/a
Emp. Form.C11H14N4O3
Mol. Mass.250.2539
SMILESCn1c2[nH]c(nc2c(=O)n(C)c1=O)C1CCOC1