Reaction Details
TargetAdenosine receptor A1
LigandBDBM69473
Substrate/Competitorn/a
Ki 367±n/a nM
CommentsPDSP_2506
Citation Bruns, RFLu, GHPugsley, TA Characterization of the A2 adenosine receptor labeled by [3H]NECA in rat striatal membranes. Mol Pharmacol29:331-46 (1986) Adenosine receptor A1
Name:Adenosine receptor A1
Type:Protein
Mol. Mass.:36704.13
Organism:Rattus norvegicus (rat)
Description:n/a
Residue:326
BDBM69473
NameBDBM69473
Synonyms:1,3-dimethyl-8-propyl-7H-purine-2,6-dione 8-Propyltheophylline SMR000528150 | cid_76104
TypeSmall organic molecule
Emp. Form.C10H14N4O2
Mol. Mass.222.2438
SMILESCCCc1nc2n(C)c(=O)n(C)c(=O)c2[nH]1