Reaction Details
TargetAdenosine receptor A1
LigandBDBM82035
Substrate/Competitorn/a
Ki 18.1±n/a nM
CommentsPDSP_2554
Citation Bruns, RFLu, GHPugsley, TA Characterization of the A2 adenosine receptor labeled by [3H]NECA in rat striatal membranes. Mol Pharmacol29:331-46 (1986) Adenosine receptor A1
Name:Adenosine receptor A1
Type:Protein
Mol. Mass.:36704.13
Organism:Rattus norvegicus (rat)
Description:n/a
Residue:326
BDBM82035
NameBDBM82035
Synonyms:N6-(2-Hydroxyethyl)ado
Typen/a
Emp. Form.C12H18N6O5
Mol. Mass.326.3085
SMILESNc1nc(NCCO)nc2n(cnc12)[C@@H]1O[C@H](CO)[C@@H](O)[C@H]1O