Reaction Details
TargetAdenosine receptor A1
LigandBDBM82022
Substrate/Competitorn/a
Ki 4.62±n/a nM
CommentsPDSP_2552
Citation Bruns, RFLu, GHPugsley, TA Characterization of the A2 adenosine receptor labeled by [3H]NECA in rat striatal membranes. Mol Pharmacol29:331-46 (1986) Adenosine receptor A1
Name:Adenosine receptor A1
Type:Protein
Mol. Mass.:36704.13
Organism:Rattus norvegicus (rat)
Description:n/a
Residue:326
BDBM82022
NameBDBM82022
Synonyms:2-(Phenylamino)ado (CV-1808) CHEMBL1256672 | N6-Phenylado
Typen/a
Emp. Form.C16H18N6O4
Mol. Mass.358.3519
SMILESNc1nc(Nc2ccccc2)nc2n(cnc12)[C@@H]1O[C@H](CO)[C@@H](O)[C@H]1O