Reaction Details
TargetAdenosine receptor A1
LigandBDBM10847
Substrate/Competitorn/a
Ki 8470±n/a nM
CommentsPDSP_2540
Citation Bruns, RFLu, GHPugsley, TA Characterization of the A2 adenosine receptor labeled by [3H]NECA in rat striatal membranes. Mol Pharmacol29:331-46 (1986) Adenosine receptor A1
Name:Adenosine receptor A1
Type:Protein
Mol. Mass.:36704.13
Organism:Rattus norvegicus (rat)
Description:n/a
Residue:326
BDBM10847
NameBDBM10847
Synonyms:1,3-dimethyl-2,3,6,7-tetrahydro-1H-purine-2,6-dione Afonilum Aminophylline Cardophyllin Theophy-lline Theophylline (1,3-dimethylxanthine)
TypeSmall organic molecule
Emp. Form.C7H8N4O2
Mol. Mass.180.164
SMILESCn1c2nc[nH]c2c(=O)n(C)c1=O