Reaction Details
TargetAdenosine receptor A2a
LigandBDBM82040
Substrate/Competitorn/a
Ki 335±n/a nM
CommentsPDSP_2523
Citation Bruns, RFLu, GHPugsley, TA Characterization of the A2 adenosine receptor labeled by [3H]NECA in rat striatal membranes. Mol Pharmacol29:331-46 (1986) Adenosine receptor A2a
Name:Adenosine receptor A2a
Type:G Protein-Coupled Receptor (GPCR)
Mol. Mass.:45015.65
Organism:Rattus norvegicus (rat)
Description:Rat A2A receptors expressed in CHO cells.
Residue:410
BDBM82040
NameBDBM82040
Synonyms:5'-O-Nitroado
Typen/a
Emp. Form.C10H12N6O6
Mol. Mass.312.2389
SMILESNc1ncnc2n(cnc12)[C@@H]1O[C@H](CON(=O)=O)[C@@H](O)[C@H]1O