Reaction Details
TargetAdenosine receptor A2a
LigandBDBM82013
Substrate/Competitorn/a
Ki 91.9±n/a nM
CommentsPDSP_2507
Citation Bruns, RFLu, GHPugsley, TA Characterization of the A2 adenosine receptor labeled by [3H]NECA in rat striatal membranes. Mol Pharmacol29:331-46 (1986) Adenosine receptor A2a
Name:Adenosine receptor A2a
Type:G Protein-Coupled Receptor (GPCR)
Mol. Mass.:44716.46
Organism:Homo sapiens (Human)
Description:P29274
Residue:412
BDBM82013
NameBDBM82013
Synonyms:8-(2-Amino-4-chloro-phenyl)-1,3-dipropyl-3,7-dihydro-purine-2,6-dione(PACPX) CAS_92411 NSC_92411 | PACPX
TypeSmall organic molecule
Emp. Form.C17H20ClN5O2
Mol. Mass.361.826
SMILESCCCn1c2nc([nH]c2c(=O)n(CCC)c1=O)-c1ccc(Cl)cc1N