Reaction Details
TargetAdenosine receptor A2a
LigandBDBM69473
Substrate/Competitorn/a
Ki>10000±n/a nM
CommentsPDSP_2506
Citation Bruns, RFLu, GHPugsley, TA Characterization of the A2 adenosine receptor labeled by [3H]NECA in rat striatal membranes. Mol Pharmacol29:331-46 (1986) Adenosine receptor A2a
Name:Adenosine receptor A2a
Type:G Protein-Coupled Receptor (GPCR)
Mol. Mass.:44716.46
Organism:Homo sapiens (Human)
Description:P29274
Residue:412
BDBM69473
NameBDBM69473
Synonyms:1,3-dimethyl-8-propyl-7H-purine-2,6-dione 8-Propyltheophylline SMR000528150 | cid_76104
TypeSmall organic molecule
Emp. Form.C10H14N4O2
Mol. Mass.222.2438
SMILESCCCc1nc2n(C)c(=O)n(C)c(=O)c2[nH]1