Reaction Details
TargetVoltage-dependent L-type calcium channel subunit alpha-1C
LigandBDBM50318494
Substrate/Competitorn/a
Ki 80.1±n/a nM
CommentsPDSP_1332
Citation Reynolds, IJSnowman, AMSnyder, SH (-)-[3H] desmethoxyverapamil labels multiple calcium channel modulator receptors in brain and skeletal muscle membranes: differentiation by temperature and dihydropyridines. J Pharmacol Exp Ther237:731-8 (1986) Voltage-dependent L-type calcium channel subunit alpha-1C
Name:Voltage-dependent L-type calcium channel subunit alpha-1C
Type:Enzyme Catalytic Domain
Mol. Mass.:243492.26
Organism:RAT
Description:Calcium channel 0 RAT::P22002
Residue:2169
BDBM50318494
NameBDBM50318494
Synonyms:3-ethyl 5-methyl 2,6-dimethyl-4-(3-nitrophenyl)-1,4-dihydropyridine-3,5-dicarboxylate NITRENDIPINE | cid_4507
TypeSmall organic molecule
Emp. Form.C18H20N2O6
Mol. Mass.360.3612
SMILESCCOC(=O)C1=C(C)N=C(C)C(C1c1cccc(c1)[N+]([O-])=O)C(=O)OC