Reaction Details
TargetVoltage-dependent L-type calcium channel subunit alpha-1C
LigandBDBM50017723
Substrate/Competitorn/a
Ki 320±n/a nM
CommentsPDSP_2659
Citation Reynolds, IJSnowman, AMSnyder, SH (-)-[3H] desmethoxyverapamil labels multiple calcium channel modulator receptors in brain and skeletal muscle membranes: differentiation by temperature and dihydropyridines. J Pharmacol Exp Ther237:731-8 (1986) Voltage-dependent L-type calcium channel subunit alpha-1C
Name:Voltage-dependent L-type calcium channel subunit alpha-1C
Type:Enzyme Catalytic Domain
Mol. Mass.:243492.26
Organism:RAT
Description:Calcium channel 0 RAT::P22002
Residue:2169
BDBM50017723
NameBDBM50017723
Synonyms:(3,3-Diphenyl-propyl)-(1-methyl-2-phenyl-ethyl)-amine Prenylamine | Prenylamine(3,3-Diphenyl-propyl)-(1-methyl-2-phenyl-ethyl)-amine
TypeSmall organic molecule
Emp. Form.C24H27N
Mol. Mass.329.4779
SMILESCC(Cc1ccccc1)NCCC(c1ccccc1)c1ccccc1