Reaction Details
TargetMu-type opioid receptor
LigandBDBM50044896
Substrate/Competitorn/a
Ki 63±n/a nM
CommentsPDSP_7114
Citation Blanchard, SGLee, PHPugh, WWHong, JSChang, KJ Characterization of the binding of a morphine (mu) receptor-specific ligand: Tyr-Pro-NMePhe-D-Pro-NH2, [3H]-PL17. Mol Pharmacol31:326-33 (1987) Mu-type opioid receptor
Name:Mu-type opioid receptor
Type:G Protein-Coupled Receptor (GPCR)
Mol. Mass.:44503.11
Organism:Rattus norvegicus (rat)
Description:Competition binding assays were carried out using membrane preparations from transfected HN9.10 cells that constitutively expressed the mu opioid receptor.
Residue:398
BDBM50044896
NameBDBM50044896
Synonyms:CHEMBL162564 Tyr-Pro-D-Phe-Pro-NH2
TypeSmall organic molecule
Emp. Form.C28H35N5O5
Mol. Mass.521.608
SMILESNC(Cc1ccc(O)cc1)C(=O)N1CCCC1C(=O)N[C@H](Cc1ccccc1)C(=O)N1CCCC1C(N)=O