Reaction Details
TargetMuscarinic acetylcholine receptor M2
LigandBDBM35256
Substrate/Competitorn/a
Ki 151.36±n/a nM
CommentsPDSP_3348
Citation de Boer, THMaura, GRaiteri, Mde Vos, CJWieringa, JPinder, RM Neurochemical and autonomic pharmacological profiles of the 6-aza-analogue of mianserin, Org 3770 and its enantiomers. Neuropharmacology27:399-408 (1988) 
 
Muscarinic acetylcholine receptor M2
Name:Muscarinic acetylcholine receptor M2
Type:Enzyme Catalytic Domain
Mol. Mass.:51555.53
Organism:RAT
Description:P10980
Residue:466
BDBM35256
NameBDBM35256
Synonyms:(S)-mianserin MIANSERIN MIANSERIN (-) | Tolvon
TypeSmall organic molecule
Emp. Form.C18H20N2
Mol. Mass.264.3648
SMILES[H][C@]12CN(C)CCN1c1ccccc1Cc1ccccc21