Reaction Details
TargetSodium-dependent dopamine transporter
LigandBDBM50010859
Substrate/Competitorn/a
Ki>10000±n/a nM
CommentsPDSP_973
Citation de Boer, THMaura, GRaiteri, Mde Vos, CJWieringa, JPinder, RM Neurochemical and autonomic pharmacological profiles of the 6-aza-analogue of mianserin, Org 3770 and its enantiomers. Neuropharmacology27:399-408 (1988) 
 
Sodium-dependent dopamine transporter
Name:Sodium-dependent dopamine transporter
Type:Multi-pass membrane protein
Mol. Mass.:68749.45
Organism:Rattus norvegicus (rat)
Description:P23977
Residue:619
BDBM50010859
NameBDBM50010859
Synonyms:CHEMBL11 IMIPRAMINE PAMOATE | Imipramin
TypeSmall organic molecule
Emp. Form.C19H24N2
Mol. Mass.280.4073
SMILESCN(C)CCCN1c2ccccc2CCc2ccccc12