Reaction Details
TargetMuscarinic acetylcholine receptor M2
LigandBDBM50015720
Substrate/Competitorn/a
Ki 0.8±n/a nM
CommentsPDSP_1688
Citation Yamamura, HISnyder, SH Muscarinic cholinergic binding in rat brain. Proc Natl Acad Sci U S A71:1725-9 (1974) 
 
Muscarinic acetylcholine receptor M2
Name:Muscarinic acetylcholine receptor M2
Type:Enzyme Catalytic Domain
Mol. Mass.:51555.53
Organism:RAT
Description:P10980
Residue:466
BDBM50015720
NameBDBM50015720
Synonyms:(hyoscine)3-Hydroxy-2-phenyl-propionic acid 9-methyl-3-oxa-9-aza-tricyclo[3.3.1.0*2,4*]non-7-yl ester 9-methyl-3-oxa-9-azatricyclo[3.3.1.02,4]non-7-yl 3-hydroxy-2-phenylpropanoate CHEMBL13030 SCOPOLAMINE
TypeSmall organic molecule
Emp. Form.C17H21NO4
Mol. Mass.303.3529
SMILESCN1C2CC(CC1C1OC21)OC(=O)C(CO)c1ccccc1