Reaction Details
TargetHistamine H1 receptor
LigandBDBM50005548
Substrate/Competitorn/a
Ki>10000±n/a nM
CommentsPDSP_1347
Citation Wong, DTThrelkeld, PGBest, KLBymaster, FP A new inhibitor of norepinephrine uptake devoid of affinity for receptors in rat brain. J Pharmacol Exp Ther222:61-5 (1982) Histamine H1 receptor
Name:Histamine H1 receptor
Type:Enzyme Catalytic Domain
Mol. Mass.:55716.35
Organism:RAT
Description:HISTAMINE H1 HRH1 RAT::P31390
Residue:486
BDBM50005548
NameBDBM50005548
Synonyms:(+)-2-Methyl-4-phenyl-1,2,3,4-tetrahydro-isoquinolin-8-ylamine (-)-2-Methyl-4-phenyl-1,2,3,4-tetrahydro-isoquinolin-8-ylamine 2-Methyl-4-phenyl-1,2,3,4-tetrahydro-isoquinolin-8-ylamine 2-Methyl-4-phenyl-1,2,3,4-tetrahydro-isoquinolin-8-ylamine(Nomifensine) CHEMBL273575 NOMIFENSINE2-Methyl-4-phenyl-1,2,3,4-tetrahydro-isoquinolin-8-ylamine
TypeSmall organic molecule
Emp. Form.C16H18N2
Mol. Mass.238.3275
SMILESCN1CC(c2ccccc2)c2cccc(N)c2C1