Reaction Details
TargetMyosin light chain kinase, smooth muscle
LigandBDBM50284317
Substrate/Competitorn/a
Meas. Tech.cGPK assay
IC50 32±n/a nM
Citation Kleinschroth, JHartenstein, JRudolph, CSchachtele, C Novel Indolocarbazole protein kinase C inhibitors with improved biochemical and physicochemical properties. Bioorg Med Chem Lett5:55-60 (1995)    Article
 
Myosin light chain kinase, smooth muscle
Name:Myosin light chain kinase, smooth muscle
Type:Protein
Mol. Mass.:210702.56
Organism:Homo sapiens (Human)
Description:Q15746
Residue:1914
BDBM50284317
NameBDBM50284317
Synonyms:3-(9-methoxy-13-methyl-5,7-dioxo-6,7,12,13-tetrahydro-5H-indolo[2,3-a]pyrrolo[3,4-c]carbazol-12-yl)propyl cyanide | CHEMBL156433
TypeSmall organic molecule
Emp. Form.C26H20N4O3
Mol. Mass.436.462
SMILESCOc1ccc2n(CCCC#N)c3c(c4C(=O)NC(=O)c4c4c5ccccc5n(C)c34)c2c1