Reaction Details
TargetMyosin light chain kinase, smooth muscle
LigandBDBM50284318
Substrate/Competitorn/a
Meas. Tech.cGPK assay
IC50 120±n/a nM
Citation Kleinschroth, JHartenstein, JRudolph, CSchachtele, C Novel Indolocarbazole protein kinase C inhibitors with improved biochemical and physicochemical properties. Bioorg Med Chem Lett5:55-60 (1995)    Article
 
Myosin light chain kinase, smooth muscle
Name:Myosin light chain kinase, smooth muscle
Type:Protein
Mol. Mass.:210702.56
Organism:Homo sapiens (Human)
Description:Q15746
Residue:1914
BDBM50284318
NameBDBM50284318
Synonyms:13-(3-dimethylamino-2-hydroxypropyl)-3-methoxy-12-methyl-6,7,12,13-tetrahydro-5H-indolo[2,3-a]pyrrolo[3,4-c]carbazole-5,7-dione | CHEMBL157822
TypeSmall organic molecule
Emp. Form.C27H26N4O4
Mol. Mass.470.5197
SMILESCOc1ccc2n(CC(O)CN(C)C)c3c(c4C(=O)NC(=O)c4c4c5ccccc5n(C)c34)c2c1