Reaction Details
TargetMyosin light chain kinase, smooth muscle
LigandBDBM3048
Substrate/Competitorn/a
Meas. Tech.cGPK assay
IC50 120±n/a nM
Citation Kleinschroth, JHartenstein, JRudolph, CSchachtele, C Novel Indolocarbazole protein kinase C inhibitors with improved biochemical and physicochemical properties. Bioorg Med Chem Lett5:55-60 (1995)    Article
 
Myosin light chain kinase, smooth muscle
Name:Myosin light chain kinase, smooth muscle
Type:Protein
Mol. Mass.:210702.56
Organism:Homo sapiens (Human)
Description:Q15746
Residue:1914
BDBM3048
NameBDBM3048
Synonyms:23-[3-(dimethylamino)-2-hydroxypropyl]-3-methyl-3,13,23-triazahexacyclo[14.7.0.0^{2,10}.0^{4,9}.0^{11,15}.0^{17,22}]tricosa-1(16),2(10),4,6,8,11(15),17(22),18,20-nonaene-12,14-dione | Indolocarbazole deriv. 3p
TypeSmall organic molecule
Emp. Form.C26H24N4O3
Mol. Mass.440.4938
SMILESCN(C)CC(O)Cn1c2ccccc2c2c3C(=O)NC(=O)c3c3c4ccccc4n(C)c3c12