Reaction Details
TargetMyosin light chain kinase, smooth muscle
LigandBDBM3041
Substrate/Competitorn/a
Meas. Tech.cGPK assay
IC50 5500±n/a nM
Citation Kleinschroth, JHartenstein, JRudolph, CSchachtele, C Novel Indolocarbazole protein kinase C inhibitors with improved biochemical and physicochemical properties. Bioorg Med Chem Lett5:55-60 (1995)    Article
 
Myosin light chain kinase, smooth muscle
Name:Myosin light chain kinase, smooth muscle
Type:Protein
Mol. Mass.:210702.56
Organism:Homo sapiens (Human)
Description:Q15746
Residue:1914
BDBM3041
NameBDBM3041
Synonyms:23-[3-(dimethylamino)-2-hydroxypropyl]-3-methyl-3,13,23-triazahexacyclo[14.7.0.0^{2,10}.0^{4,9}.0^{11,15}.0^{17,22}]tricosa-1(16),2(10),4,6,8,11(15),17(22),18,20-nonaen-12-one Indolocarbazole deriv.
TypeSmall organic molecule
Emp. Form.C26H26N4O2
Mol. Mass.426.5102
SMILESCN(C)CC(O)Cn1c2ccccc2c2c3CNC(=O)c3c3c4ccccc4n(C)c3c12