Reaction Details
TargetMyosin light chain kinase, smooth muscle
LigandBDBM3043
Substrate/Competitorn/a
Meas. Tech.cGPK assay
IC50 55±n/a nM
Citation Kleinschroth, JHartenstein, JRudolph, CSchachtele, C Novel Indolocarbazole protein kinase C inhibitors with improved biochemical and physicochemical properties. Bioorg Med Chem Lett5:55-60 (1995)    Article
 
Myosin light chain kinase, smooth muscle
Name:Myosin light chain kinase, smooth muscle
Type:Protein
Mol. Mass.:210702.56
Organism:Homo sapiens (Human)
Description:Q15746
Residue:1914
BDBM3043
NameBDBM3043
Synonyms:3-{23-methyl-12,14-dioxo-3,13,23-triazahexacyclo[14.7.0.0^{2,10}.0^{4,9}.0^{11,15}.0^{17,22}]tricosa-1(16),2(10),4(9),5,7,11(15),17,19,21-nonaen-3-yl}propanenitrile | Indolocarbazole deriv. 3k
TypeSmall organic molecule
Emp. Form.C24H16N4O2
Mol. Mass.392.4094
SMILESCn1c2ccccc2c2c3C(=O)NC(=O)c3c3c4ccccc4n(CCC#N)c3c12