Reaction Details
TargetMyosin light chain kinase, smooth muscle
LigandBDBM3037
Substrate/Competitorn/a
Meas. Tech.cGPK assay
IC50 220±n/a nM
Citation Kleinschroth, JHartenstein, JRudolph, CSchachtele, C Novel Indolocarbazole protein kinase C inhibitors with improved biochemical and physicochemical properties. Bioorg Med Chem Lett5:55-60 (1995)    Article
 
Myosin light chain kinase, smooth muscle
Name:Myosin light chain kinase, smooth muscle
Type:Protein
Mol. Mass.:210702.56
Organism:Homo sapiens (Human)
Description:Q15746
Residue:1914
BDBM3037
NameBDBM3037
Synonyms:23-[3-(dimethylamino)propyl]-7,19-dimethoxy-3,13,23-triazahexacyclo[14.7.0.0^{2,10}.0^{4,9}.0^{11,15}.0^{17,22}]tricosa-1(16),2(10),4,6,8,11(15),17(22),18,20-nonaen-12-one | Indolocarbazole deriv. 3e
TypeSmall organic molecule
Emp. Form.C27H28N4O3
Mol. Mass.456.5362
SMILESCOc1ccc2[nH]c3c(c4C(=O)NCc4c4c5cc(OC)ccc5n(CCCN(C)C)c34)c2c1