Reaction Details
TargetcGMP-dependent protein kinase 1
LigandBDBM50284318
Substrate/Competitorn/a
Meas. Tech.MLCK assay
IC50 4800±n/a nM
Citation Kleinschroth, JHartenstein, JRudolph, CSchachtele, C Novel Indolocarbazole protein kinase C inhibitors with improved biochemical and physicochemical properties. Bioorg Med Chem Lett5:55-60 (1995)    Article
 
cGMP-dependent protein kinase 1
Name:cGMP-dependent protein kinase 1
Type:Enzyme
Mol. Mass.:76413.14
Organism:Bos taurus (bovine)
Description:n/a
Residue:671
BDBM50284318
NameBDBM50284318
Synonyms:13-(3-dimethylamino-2-hydroxypropyl)-3-methoxy-12-methyl-6,7,12,13-tetrahydro-5H-indolo[2,3-a]pyrrolo[3,4-c]carbazole-5,7-dione | CHEMBL157822
TypeSmall organic molecule
Emp. Form.C27H26N4O4
Mol. Mass.470.5197
SMILESCOc1ccc2n(CC(O)CN(C)C)c3c(c4C(=O)NC(=O)c4c4c5ccccc5n(C)c34)c2c1