Reaction Details
TargetHistamine H2 receptor
LigandBDBM81468
Substrate/Competitorn/a
Ki 510±n/a nM
CommentsPDSP_1231
Citation Gajtkowski, GANorris, DBRising, TJWood, TP Specific binding of 3H-tiotidine to histamine H2 receptors in guinea pig cerebral cortex. Nature304:65-7 (1983) 
 
Histamine H2 receptor
Name:Histamine H2 receptor
Type:G Protein-Coupled Receptor (GPCR)
Mol. Mass.:40567.22
Organism:Cavia porcellus (domestic guinea pig)
Description:For the H2 receptor-binding assays, guinea pig striatum was used.
Residue:359
BDBM81468
NameBDBM81468
Synonyms:CAS_34839-70-8 NSC_1548992
TypeSmall organic molecule
Emp. Form.C9H16N4S2
Mol. Mass.244.38
SMILESCNC(=S)NCCSCc1[nH]cnc1C