Reaction Details
TargetHistamine H2 receptor
LigandBDBM22893
Substrate/Competitorn/a
Ki 390±n/a nM
CommentsPDSP_1588
Citation Gajtkowski, GANorris, DBRising, TJWood, TP Specific binding of 3H-tiotidine to histamine H2 receptors in guinea pig cerebral cortex. Nature304:65-7 (1983) 
 
Histamine H2 receptor
Name:Histamine H2 receptor
Type:G Protein-Coupled Receptor (GPCR)
Mol. Mass.:40567.22
Organism:Cavia porcellus (domestic guinea pig)
Description:For the H2 receptor-binding assays, guinea pig striatum was used.
Residue:359
BDBM22893
NameBDBM22893
Synonyms:CHEMBL512 ZANTAC | dimethyl[(5-{[(2-{[(E)-1-(methylamino)-2-nitroethenyl]amino}ethyl)sulfanyl]methyl}furan-2-yl)methyl]amine
TypeSmall organic molecule
Emp. Form.C13H22N4O3S
Mol. Mass.314.404
SMILESCN\C([CH-][N+]([O-])=O)=[NH+]/CCSCc1ccc(CN(C)C)o1