Reaction Details
TargetHistamine H1 receptor
LigandBDBM50010859
Substrate/Competitorn/a
Ki 16±n/a nM
CommentsPDSP_973
Citation Kanba, SRichelson, E Histamine H1 receptors in human brain labelled with [3H]doxepin. Brain Res304:1-7 (1984) 
 
Histamine H1 receptor
Name:Histamine H1 receptor
Type:G Protein-Coupled Receptor (GPCR)
Mol. Mass.:55808.72
Organism:Homo sapiens (Human)
Description:Cell pellets from SK-N-MC cells transfected with human H1 receptor were used in binding assay.
Residue:487
BDBM50010859
NameBDBM50010859
Synonyms:CHEMBL11 IMIPRAMINE PAMOATE | Imipramin
TypeSmall organic molecule
Emp. Form.C19H24N2
Mol. Mass.280.4073
SMILESCN(C)CCCN1c2ccccc2CCc2ccccc12