Reaction Details
TargetHistamine H1 receptor
LigandBDBM35256
Substrate/Competitorn/a
Ki 0.36±n/a nM
CommentsPDSP_1235
Citation Kanba, SRichelson, E Histamine H1 receptors in human brain labelled with [3H]doxepin. Brain Res304:1-7 (1984) 
 
Histamine H1 receptor
Name:Histamine H1 receptor
Type:G Protein-Coupled Receptor (GPCR)
Mol. Mass.:55808.72
Organism:Homo sapiens (Human)
Description:Cell pellets from SK-N-MC cells transfected with human H1 receptor were used in binding assay.
Residue:487
BDBM35256
NameBDBM35256
Synonyms:(S)-mianserin MIANSERIN MIANSERIN (-) | Tolvon
TypeSmall organic molecule
Emp. Form.C18H20N2
Mol. Mass.264.3648
SMILES[H][C@]12CN(C)CCN1c1ccccc1Cc1ccccc21