Reaction Details
TargetBeta-arrestin-1
LigandBDBM81934
Substrate/Competitorn/a
Ki 21±n/a nM
CommentsPDSP_345
Citation Leslie, FMChavkin, CCox, BM Opioid binding properties of brain and peripheral tissues: evidence for heterogeneity in opioid ligand binding sites. J Pharmacol Exp Ther214:395-402 (1980) Beta-arrestin-1
Name:Beta-arrestin-1
Type:Enzyme Catalytic Domain
Mol. Mass.:46360.54
Organism:RABBIT
Description:Cholinergic, muscarinic 0 RABBIT::Q95223
Residue:410
BDBM81934
NameBDBM81934
Synonyms:Beta-Endorphin
TypeSmall organic molecule
Emp. Form.C154H248N42O44S
Mol. Mass.3423.937
SMILESCC[C@H](C)[C@H](NC(=O)[C@H](C)NC(=O)[C@H](CC(N)=O)NC(=O)[C@H](CCCCN)NC(=O)[C@H](Cc1ccccc1)NC(=O)[C@H](CC(C)C)NC(=O)[C@@H](NC(=O)[C@@H](NC(=O)[C@H](CC(C)C)NC(=O)[C@@H]1CCCN1C(=O)[C@@H](NC(=O)[C@H](CCC(N)=O)NC(=O)[C@H](CO)NC(=O)[C@H](CCCCN)NC(=O)[C@H](CCC(O)=O)NC(=O)[C@H](CO)NC(=O)[C@@H](NC(=O)[C@H](CCSC)NC(=O)[C@H](Cc1ccccc1)NC(=O)CNC(=O)CNC(=O)[C@@H](N)Cc1ccc(O)cc1)[C@@H](C)O)[C@@H](C)O)C(C)C)[C@@H](C)O)C(=O)N[C@@H](C(C)C)C(=O)N[C@@H](CCCCN)C(=O)N[C@@H](CC(N)=O)C(=O)N[C@@H](C)C(=O)N[C@@H](Cc1cnc[nH]1)C(=O)N[C@@H](CCCCN)C(=O)N[C@@H](CCCCN)C(=O)NCC(=O)N[C@@H](CCC(N)=O)C(O)=O