Reaction Details
TargetProstacyclin receptor
LigandBDBM50101828
Substrate/Competitorn/a
Ki 137±n/a nM
CommentsPDSP_1459
Citation Blair, IAMacDermot, J The binding of [3H]-prostacyclin to membranes of a neuronal somatic hybrid. Br J Pharmacol72:435-41 (1981) 
 
Prostacyclin receptor
Name:Prostacyclin receptor
Type:G Protein-Coupled Receptor (GPCR)
Mol. Mass.:40968.22
Organism:Homo sapiens (Human)
Description:The membranes prepared from human platelet were used in binding assay.
Residue:386
BDBM50101828
NameBDBM50101828
Synonyms:7-[(1R,2R,3R)-3-Hydroxy-2-((E)-(R)-3-hydroxy-oct-1-enyl)-5-oxo-cyclopentyl]-heptanoic acid PGE1 | US9180116, PGE1
TypeSmall organic molecule
Emp. Form.C20H34O5
Mol. Mass.354.481
SMILESCCCCC[C@@H](O)\C=C\[C@H]1[C@H](O)CC(=O)[C@@H]1CCCCCCC(O)=O