Reaction Details
TargetProstacyclin receptor
LigandBDBM35847
Substrate/Competitorn/a
Ki>10000±n/a nM
CommentsPDSP_1462
Citation Blair, IAMacDermot, J The binding of [3H]-prostacyclin to membranes of a neuronal somatic hybrid. Br J Pharmacol72:435-41 (1981) 
 
Prostacyclin receptor
Name:Prostacyclin receptor
Type:G Protein-Coupled Receptor (GPCR)
Mol. Mass.:40968.22
Organism:Homo sapiens (Human)
Description:The membranes prepared from human platelet were used in binding assay.
Residue:386
BDBM35847
NameBDBM35847
Synonyms:(15S)-prostaglandin E2 (5Z,13E,15S)-11alpha,15-dihydroxy-9-oxoprosta-5,13-dien-1-oic acid CHEMBL548 PGE2 [3H]PGE2 prostaglandin E2
Typeradiolabeled ligand
Emp. Form.C20H32O5
Mol. Mass.352.4651
SMILESCCCCC[C@H](O)\C=C\[C@H]1[C@H](O)CC(=O)[C@@H]1C\C=C/CCCC(O)=O