Reaction Details
TargetProstacyclin receptor
LigandBDBM82097
Substrate/Competitorn/a
Ki 7350±n/a nM
CommentsPDSP_5307
Citation Blair, IAMacDermot, J The binding of [3H]-prostacyclin to membranes of a neuronal somatic hybrid. Br J Pharmacol72:435-41 (1981) 
 
Prostacyclin receptor
Name:Prostacyclin receptor
Type:G Protein-Coupled Receptor (GPCR)
Mol. Mass.:40968.22
Organism:Homo sapiens (Human)
Description:The membranes prepared from human platelet were used in binding assay.
Residue:386
BDBM82097
NameBDBM82097
Synonyms:CAS_162981 PGI1, 6beta
TypeSmall organic molecule
Emp. Form.C20H34O5
Mol. Mass.354.481
SMILESCCCCCC(O)C=CC1C(O)CC2OC(CCCCC(O)=O)CC12