Reaction Details
TargetCarbonic anhydrase 9
LigandBDBM26999
Substrate/Competitorn/a
Meas. Tech.Inhibition Assay
pH7.5±0
Temperature293.15±0 K
Ki 43±0.0 nM
Citation De Simone, GScozzafava, ASupuran, CT Which carbonic anhydrases are targeted by the antiepileptic sulfonamides and sulfamates? Chem Biol Drug Des74:317-21 (2009) 
 
Carbonic anhydrase 9
Name:Carbonic anhydrase 9
Type:Enzyme
Mol. Mass.:49669.03
Organism:Homo sapiens (Human)
Description:Catalytic domain of human cloned isozyme was used in the assay
Residue:459
BDBM26999
NameBDBM26999
Synonyms:4-(1,1-dioxo-1,2-thiazinan-2-yl)benzene-1-sulfonamide Contravul Sulthiame (SLT) | Sulthiame, 2
TypeSmall organic molecule
Emp. Form.C10H14N2O4S2
Mol. Mass.290.359
SMILESNS(=O)(=O)c1ccc(cc1)N1CCCCS1(=O)=O