Reaction Details
TargetCarbonic anhydrase 14
LigandBDBM26999
Substrate/Competitorn/a
Meas. Tech.Inhibition Assay
pH7.5±0
Temperature293.15±0 K
Ki 1540±0.0 nM
Citation De Simone, GScozzafava, ASupuran, CT Which carbonic anhydrases are targeted by the antiepileptic sulfonamides and sulfamates? Chem Biol Drug Des74:317-21 (2009) 
 
Carbonic anhydrase 14
Name:Carbonic anhydrase 14
Type:Enzyme
Mol. Mass.:37665.67
Organism:Homo sapiens (Human)
Description:Human (cloned) isozyme.
Residue:337
BDBM26999
NameBDBM26999
Synonyms:4-(1,1-dioxo-1,2-thiazinan-2-yl)benzene-1-sulfonamide Contravul Sulthiame (SLT) | Sulthiame, 2
TypeSmall organic molecule
Emp. Form.C10H14N2O4S2
Mol. Mass.290.359
SMILESNS(=O)(=O)c1ccc(cc1)N1CCCCS1(=O)=O