Reaction Details
TargetCarbonic anhydrase 13
LigandBDBM50210256
Substrate/Competitorn/a
Meas. Tech.Inhibition Assay
pH7.5±0
Temperature293.15±0 K
Ki 47±0.0 nM
Citation De Simone, GScozzafava, ASupuran, CT Which carbonic anhydrases are targeted by the antiepileptic sulfonamides and sulfamates? Chem Biol Drug Des74:317-21 (2009) 
 
Carbonic anhydrase 13
Name:Carbonic anhydrase 13
Type:Enzyme
Mol. Mass.:29445.78
Organism:Homo sapiens (Human)
Description:Q8N1Q1
Residue:262
BDBM50210256
NameBDBM50210256
Synonyms:CHEMBL26300 Topiramate, 3
TypeSmall organic molecule
Emp. Form.C13H23NO7S
Mol. Mass.337.389
SMILESCC1(C)O[C@@H]2CC[C@@]3(COS(N)(=O)=O)OC(C)(C)O[C@H]3[C@@H]2O1