Reaction Details
TargetCarbonic anhydrase 3
LigandBDBM82103
Substrate/Competitorn/a
Meas. Tech.Inhibition Assay
pH7.5±0
Temperature293.15±0 K
Ki 3.1E5±0.0 nM
Citation De Simone, GScozzafava, ASupuran, CT Which carbonic anhydrases are targeted by the antiepileptic sulfonamides and sulfamates? Chem Biol Drug Des74:317-21 (2009) 
 
Carbonic anhydrase 3
Name:Carbonic anhydrase 3
Type:Enzyme
Mol. Mass.:29562.11
Organism:Homo sapiens (Human)
Description:Human cloned isozyme.
Residue:260
BDBM82103
NameBDBM82103
Synonyms:Investigational agent, 4
TypeSmall organic molecule
Emp. Form.C13H18N4O3S2
Mol. Mass.342.437
SMILESNS(=O)(=O)c1nnc(NC(=O)[C@]23C[C@H]4C[C@H](C[C@H](C4)C2)C3)s1