Reaction Details
TargetP2X purinoceptor 3
LigandBDBM271501
Substrate/Competitorn/a
Meas. Tech.Rat P2X3 Binding Assay
IC50 6.00±n/a nM
Citation Kai, H Aminotriazine derivative and pharmaceutical composition comprising the same US Patent US10065941 Publication Date 9/4/2018
 
P2X purinoceptor 3
Name:P2X purinoceptor 3
Type:Enzyme Catalytic Domain
Mol. Mass.:44397.63
Organism:RAT
Description:Purinergic, P2X3 0 RAT::P49654
Residue:397
BDBM271501
NameBDBM271501
Synonyms:US10065941, Compound I-002 | US9732060, Compound I-002
TypeSmall organic molecule
Emp. Form.C26H22ClF2N5O5
Mol. Mass.557.933
SMILESC[C@H]([C@H](C)n1c(=O)[nH]\c(=N/c2ccc(Oc3ccc(F)cn3)c(F)c2)n(Cc2ccc(Cl)cc2)c1=O)C(O)=O