Reaction Details
TargetP2X purinoceptor 3
LigandBDBM271599
Substrate/Competitorn/a
Meas. Tech.Rat P2X3 Binding Assay in Rat Serum Albumin (HSA)
IC50 9.00±n/a nM
Citation Kai, H Aminotriazine derivative and pharmaceutical composition comprising the same US Patent US10065941 Publication Date 9/4/2018
 
P2X purinoceptor 3
Name:P2X purinoceptor 3
Type:Enzyme Catalytic Domain
Mol. Mass.:44397.63
Organism:RAT
Description:Purinergic, P2X3 0 RAT::P49654
Residue:397
BDBM271599
NameBDBM271599
Synonyms:US10065941, Compound I-100 | US9732060, Compound I-100
TypeSmall organic molecule
Emp. Form.C26H24ClN5O5
Mol. Mass.521.952
SMILESC[C@@H](Cn1c(=O)[nH]\c(=N/c2ccc(Oc3ccc(Cl)cn3)cc2)n(Cc2ccc(C)cc2)c1=O)C(O)=O