Reaction Details
TargetHeat shock 70 kDa protein 1A
LigandBDBM32376
Substrate/Competitorn/a
Meas. Tech.Fluorescence-Polarization (FP) Binding Assay
pH7.4±0
Temperature298.15±0 K
Ki 1.44e+3±n/a nM
Citation Macias, ATWilliamson, DSAllen, NBorgognoni, JClay, ADaniels, ZDokurno, PDrysdale, MJFrancis, GLGraham, CJHowes, RMatassova, NMurray, JBParsons, RShaw, TSurgenor, AETerry, LWang, YWood, MMassey, AJ Adenosine-derived inhibitors of 78 kDa glucose regulated protein (Grp78) ATPase: insights into isoform selectivity. J Med Chem54:4034-41 (2011) 
 
Heat shock 70 kDa protein 1A
Name:Heat shock 70 kDa protein 1A
Type:Chaperone
Mol. Mass.:70043.82
Organism:Homo sapiens (Human)
Description:n/a
Residue:641
BDBM32376
NameBDBM32376
Synonyms:adenosine-derived inhibitor (Grp78), 11 | adenosine-derived inhibitor, 10
TypeSmall organic molecule
Emp. Form.C18H20Cl2N6O4
Mol. Mass.455.295
SMILESCOC[C@H]1O[C@H]([C@H](O)[C@@H]1O)n1c(NCc2ccc(Cl)c(Cl)c2)nc2c(N)ncnc12