Reaction Details
TargetSerum paraoxonase/arylesterase 1
LigandBDBM10860
Substrate/Competitorn/a
Meas. Tech.In Vitro Inhibtion Assay
Ki 340000±0.0 nM
IC50 190000±0.0 nM
Citation Ekinci, DSentürk, MBeydemir, SKüfrevioglu, OISupuran, CT An alternative purification method for human serum paraoxonase 1 and its interactions with sulfonamides. Chem Biol Drug Des76:552-8 (2010) 
 
Serum paraoxonase/arylesterase 1
Name:Serum paraoxonase/arylesterase 1
Type:Enzyme
Mol. Mass.:39719.73
Organism:Homo sapiens (Human)
Description:P27169
Residue:355
BDBM10860
NameBDBM10860
Synonyms:4-(aminomethyl)benzene-1-sulfonamide MAFENIDE aromatic/heteroaromatic sulfonamide 5 | hCA inhibitor, 9
TypeSmall organic molecule
Emp. Form.C7H10N2O2S
Mol. Mass.186.232
SMILESNCc1ccc(cc1)S(N)(=O)=O